center-n
type: LexicalEntry
canonical form: center
sense: 08498843-n
part of speech: noun

centre-n
type: LexicalEntry
canonical form: centre
sense: 08498843-n
part of speech: noun

08498843-n
type: LexicalConcept
in scheme: en-word.net
definition: the middle of a military or naval formation
example: they had to reinforce the center
ili: i81624
lexfile: noun.group
part of speech: noun
domain topic: 08215965-n
hypernym: 08443418-n