law-n
type: LexicalEntry
canonical form: law
sense: 08458195-n
part of speech: noun

jurisprudence-n
type: LexicalEntry
canonical form: jurisprudence
sense: 08458195-n
part of speech: noun

08458195-n
type: LexicalConcept
in scheme: en-word.net
definition: the collection of rules imposed by authority
example: civilization presupposes respect for the law
example: the great problem for jurisprudence to allow freedom while enforcing order
ili: i81481
lexfile: noun.group
part of speech: noun
hypernym: 07968050-n
mero part: 06544321-n