garden-n
type: LexicalEntry
canonical form: garden
sense: 08456800-n
part of speech: noun

08456800-n
type: LexicalConcept
in scheme: en-word.net
definition: the flowers or vegetables or fruits or herbs that are cultivated in a garden
ili: i81475
lexfile: noun.group
part of speech: noun
hypernym: 08453769-n