craft-n
type: LexicalEntry
canonical form: craft
sense: 08453572-n
part of speech: noun

trade-n
type: LexicalEntry
canonical form: trade
sense: 08453572-n
part of speech: noun

08453572-n
type: LexicalConcept
in scheme: en-word.net
definition: people who perform a particular kind of skilled work
example: he represented the craft of brewers
example: as they say in the trade
ili: i81456
lexfile: noun.group
part of speech: noun
hypernym: 07990472-n