row-n-1
type: LexicalEntry
canonical form: row
sense: 08450457-n
part of speech: noun

08450457-n
type: LexicalConcept
in scheme: en-word.net
definition: a linear array of numbers, letters, or symbols side by side
ili: i81440
lexfile: noun.group
part of speech: noun
hypernym: 07955622-n