line-n
type: LexicalEntry
canonical form: line
sense: 08447160-n
part of speech: noun

08447160-n
type: LexicalConcept
in scheme: en-word.net
definition: a formation of people or things one behind another
example: the line stretched clear around the corner
example: you must wait in a long line at the checkout counter
ili: i81420
lexfile: noun.group
part of speech: noun
hypernym: 08443418-n