panel-n
type: LexicalEntry
canonical form: panel
sense: 08431565-n
part of speech: noun

venire-n
type: LexicalEntry
canonical form: venire
sense: 08431565-n
part of speech: noun

08431565-n
type: LexicalConcept
in scheme: en-word.net
definition: (law) a group of people summoned for jury service (from whom a jury will be chosen)
ili: i81330
lexfile: noun.group
part of speech: noun
domain topic: 08458195-n
hypernym: 07981699-n