panel-n
type: LexicalEntry
canonical form: panel
sense: 08431338-n
part of speech: noun

08431338-n
type: LexicalConcept
in scheme: en-word.net
definition: a group of people gathered for a special purpose as to plan or discuss an issue or judge a contest etc
ili: i81329
lexfile: noun.group
part of speech: noun
hypernym: 07981699-n
mero member: 10415805-n