fair-n
type: LexicalEntry
canonical form: fair
sense: 08425224-n
part of speech: noun

08425224-n
type: LexicalConcept
in scheme: en-word.net
definition: a competitive exhibition of farm products
example: she won a blue ribbon for her baking at the county fair
ili: i81291
lexfile: noun.group
part of speech: noun
hypernym: 08424576-n