cabinet-n
type: LexicalEntry
canonical form: cabinet
sense: 08398551-n
part of speech: noun

08398551-n
type: LexicalConcept
in scheme: en-word.net
definition: persons appointed by a head of state to head executive departments of government and act as official advisers
ili: i81153
lexfile: noun.group
part of speech: noun
hypernym: 08398367-n
mero member: 00587001-n