office-n
type: LexicalEntry
canonical form: office
sense: 08369230-n
part of speech: noun

office staff-n
type: LexicalEntry
canonical form: office staff
sense: 08369230-n
part of speech: noun

08369230-n
type: LexicalConcept
in scheme: en-word.net
definition: professional or clerical workers in an office
example: the whole office was late the morning of the blizzard
ili: i80999
lexfile: noun.group
part of speech: noun
hypernym: 08456947-n