bench-n
type: LexicalEntry
canonical form: bench
sense: 08345627-n
part of speech: noun

08345627-n
type: LexicalConcept
in scheme: en-word.net
definition: the magistrate or judge or judges sitting in court in judicial capacity to compose the court collectively
ili: i80902
lexfile: noun.group
part of speech: noun
hypernym: 08180691-n