conference-n
type: LexicalEntry
canonical form: conference
sense: 08325427-n
part of speech: noun

08325427-n
type: LexicalConcept
in scheme: en-word.net
definition: a prearranged meeting for consultation or exchange of information or discussion (especially one with a formal agenda)
ili: i80796
lexfile: noun.group
part of speech: noun
hypernym: 08324519-n
mero member: 09973444-n