federation-n
type: LexicalEntry
canonical form: federation
sense: 08320434-n
part of speech: noun

08320434-n
type: LexicalConcept
in scheme: en-word.net
definition: an organization formed by merging several groups or parties
ili: i80772
lexfile: noun.group
part of speech: noun
hypernym: 08024893-n