school-n
type: LexicalEntry
canonical form: school
sense: 08294314-n
part of speech: noun

08294314-n
type: LexicalConcept
in scheme: en-word.net
definition: an educational institution's faculty and students
example: the school keeps parents informed
example: the whole school turned out for the game
ili: i80637
lexfile: noun.group
part of speech: noun
hypernym: 08293263-n