crew-n
type: LexicalEntry
canonical form: crew
sense: 08290657-n
part of speech: noun

08290657-n
type: LexicalConcept
in scheme: en-word.net
definition: the team of men or women manning a racing shell
ili: i80618
lexfile: noun.group
part of speech: noun
hypernym: 08225481-n