table-n
type: LexicalEntry
canonical form: table
sense: 08283156-n
part of speech: noun

tabular array-n
type: LexicalEntry
canonical form: tabular array
sense: 08283156-n
part of speech: noun

08283156-n
type: LexicalConcept
in scheme: en-word.net
definition: a set of data arranged in rows and columns
example: see table 1
ili: i80574
lexfile: noun.group
part of speech: noun
hypernym: 07955622-n
mero member: 08450457-n
mero member: 08450585-n