party-n
type: LexicalEntry
canonical form: party
sense: 08281818-n
part of speech: noun

company-n
type: LexicalEntry
canonical form: company
sense: 08281818-n
part of speech: noun

08281818-n
type: LexicalConcept
in scheme: en-word.net
definition: a band of people associated temporarily in some activity
example: they organized a party to search for food
example: the company of cooks walked into the kitchen
ili: i80565
lexfile: noun.group
part of speech: noun
hypernym: 08257090-n