cadre-n
type: LexicalEntry
canonical form: cadre
sense: 08259021-n
part of speech: noun

08259021-n
type: LexicalConcept
in scheme: en-word.net
definition: a nucleus of military personnel capable of expansion
ili: i80433
lexfile: noun.group
part of speech: noun
hypernym: 08259144-n