section-n
type: LexicalEntry
canonical form: section
sense: 08256073-n
part of speech: noun

discussion section-n
type: LexicalEntry
canonical form: discussion section
sense: 08256073-n
part of speech: noun

08256073-n
type: LexicalConcept
in scheme: en-word.net
definition: a small class of students who are part of a larger course but are taught separately
example: a graduate student taught sections for the professor's lecture course
ili: i80417
lexfile: noun.group
part of speech: noun
hypernym: 08255384-n