league-n
type: LexicalEntry
canonical form: league
sense: 08248105-n
part of speech: noun

conference-n
type: LexicalEntry
canonical form: conference
sense: 08248105-n
part of speech: noun

08248105-n
type: LexicalConcept
in scheme: en-word.net
definition: an association of sports teams that organizes matches for its members
ili: i80373
lexfile: noun.group
part of speech: noun
hypernym: 08066153-n