yoke-n
type: LexicalEntry
canonical form: yoke
sense: 08247986-n
part of speech: noun

08247986-n
type: LexicalConcept
in scheme: en-word.net
definition: a pair of draft animals joined by a yoke
example: pulled by a yoke of oxen
ili: i80372
lexfile: noun.group
part of speech: noun
hypernym: 07993383-n