city-n
type: LexicalEntry
canonical form: city
sense: 08243256-n
part of speech: noun

metropolis-n
type: LexicalEntry
canonical form: metropolis
sense: 08243256-n
part of speech: noun

08243256-n
type: LexicalConcept
in scheme: en-word.net
definition: people living in a large densely populated municipality
example: the city voted for Republicans in 1994
ili: i80341
lexfile: noun.group
part of speech: noun
hypernym: 08242502-n