audience-n
type: LexicalEntry
canonical form: audience
sense: 08239214-n
part of speech: noun

08239214-n
type: LexicalConcept
in scheme: en-word.net
definition: the part of the general public interested in a source of information, entertainment, or a product/service
example: every artist needs an audience
example: the broadcast reached an audience of millions
ili: i80317
lexfile: noun.group
part of speech: noun
hypernym: 08197108-n