brass section-n
type: LexicalEntry
canonical form: brass section
sense: 08234056-n
part of speech: noun

brass-n
type: LexicalEntry
canonical form: brass
sense: 08234056-n
part of speech: noun

08234056-n
type: LexicalConcept
in scheme: en-word.net
definition: the section of a band or orchestra that plays brass instruments
ili: i80284
lexfile: noun.group
part of speech: noun
hypernym: 08233821-n