vanguard-n
type: LexicalEntry
canonical form: vanguard
sense: 08232416-n
part of speech: noun

van-n
type: LexicalEntry
canonical form: van
sense: 08232416-n
part of speech: noun

08232416-n
type: LexicalConcept
in scheme: en-word.net
definition: the leading units moving at the head of an army
ili: i80273
lexfile: noun.group
part of speech: noun
hypernym: 08207684-n