unit-n
type: LexicalEntry
canonical form: unit
sense: 08206589-n
part of speech: noun

social unit-n
type: LexicalEntry
canonical form: social unit
sense: 08206589-n
part of speech: noun

08206589-n
type: LexicalConcept
in scheme: en-word.net
definition: an organization regarded as part of a larger social group
example: the coach said the offensive unit did a good job
example: after the battle the soldier had trouble rejoining his unit
ili: i80188
lexfile: noun.group
part of speech: noun
hypernym: 08024893-n