circus-n
type: LexicalEntry
canonical form: circus
sense: 08206141-n
part of speech: noun

08206141-n
type: LexicalConcept
in scheme: en-word.net
definition: a travelling company of entertainers; including trained animals
example: he ran away from home to join the circus
ili: i80185
lexfile: noun.group
part of speech: noun
hypernym: 08203951-n