choir-n
type: LexicalEntry
canonical form: choir
sense: 08205744-n
part of speech: noun

consort-n
type: LexicalEntry
canonical form: consort
sense: 08205744-n
part of speech: noun

08205744-n
type: LexicalConcept
in scheme: en-word.net
definition: a family of similar musical instrument playing together
ili: i80182
lexfile: noun.group
part of speech: noun
hypernym: 08013131-n