chorus-n
type: LexicalEntry
canonical form: chorus
sense: 08205379-n
part of speech: noun

chorus line-n
type: LexicalEntry
canonical form: chorus line
sense: 08205379-n
part of speech: noun

08205379-n
type: LexicalConcept
in scheme: en-word.net
definition: a body of dancers or singers who perform together
ili: i80180
lexfile: noun.group
part of speech: noun
hypernym: 08447525-n
mero member: 09940359-n