crowd-n
type: LexicalEntry
canonical form: crowd
sense: 08199297-n
part of speech: noun

08199297-n
type: LexicalConcept
in scheme: en-word.net
definition: a large number of things or people considered together
example: a crowd of insects assembled around the flowers
ili: i80141
lexfile: noun.group
part of speech: noun
hypernym: 07991473-n