denomination-n
type: LexicalEntry
canonical form: denomination
sense: 08163789-n
part of speech: noun

08163789-n
type: LexicalConcept
in scheme: en-word.net
definition: a group of religious congregations having its own organization and a distinctive faith
ili: i79968
lexfile: noun.group
part of speech: noun
hypernym: 08026566-n
mero member: 08007806-n
mero member: 09867135-n