security-n
type: LexicalEntry
canonical form: security
sense: 08137885-n
part of speech: noun

security department-n
type: LexicalEntry
canonical form: security department
sense: 08137885-n
part of speech: noun

08137885-n
type: LexicalConcept
in scheme: en-word.net
definition: a department responsible for the security of the institution's property and workers
example: the head of security was a former policeman
ili: i79863
lexfile: noun.group
part of speech: noun
hypernym: 08131836-n