class-n
type: LexicalEntry
canonical form: class
sense: 08120743-n
part of speech: noun

08120743-n
type: LexicalConcept
in scheme: en-word.net
definition: (biology) a taxonomic group containing one or more orders
ili: i79788
lexfile: noun.group
part of speech: noun
domain topic: 06047178-n
hypernym: 08008892-n
mero member: 08123900-n