variety-n
type: LexicalEntry
canonical form: variety
sense: 08118051-n
part of speech: noun

08118051-n
type: LexicalConcept
in scheme: en-word.net
definition: (biology) a taxonomic category consisting of members of a species that differ from others of the same species in minor but heritable characteristics
example: varieties are frequently recognized in botany
ili: i79777
lexfile: noun.group
part of speech: noun
domain topic: 06047178-n
hypernym: 08008892-n