field-n
type: LexicalEntry
canonical form: field
sense: 08015913-n
part of speech: noun

08015913-n
type: LexicalConcept
in scheme: en-word.net
definition: all the competitors in a particular contest or sporting event
ili: i79328
lexfile: noun.group
part of speech: noun
hypernym: 08013131-n