association-n
type: LexicalEntry
canonical form: association
sense: 08006819-n
part of speech: noun

08006819-n
type: LexicalConcept
in scheme: en-word.net
definition: (ecology) a group of organisms (plants and animals) that live together in a certain geographical region and constitute a community with a few dominant species
ili: i79278
lexfile: noun.group
part of speech: noun
domain topic: 06080479-n
hypernym: 00031563-n