turnout-n
type: LexicalEntry
canonical form: turnout
sense: 08003658-n
part of speech: noun

08003658-n
type: LexicalConcept
in scheme: en-word.net
definition: the group that gathers together for a particular occasion
example: a large turnout for the meeting
ili: i79257
lexfile: noun.group
part of speech: noun
hypernym: 07991473-n