fringe-n
type: LexicalEntry
canonical form: fringe
sense: 07991297-n
part of speech: noun

07991297-n
type: LexicalConcept
in scheme: en-word.net
definition: a social group holding marginal or extreme views
example: members of the fringe believe we should be armed with guns at all times
ili: i79219
lexfile: noun.group
part of speech: noun
hypernym: 07967506-n