race-n
type: LexicalEntry
canonical form: race
sense: 07984596-n
part of speech: noun

07984596-n
type: LexicalConcept
in scheme: en-word.net
definition: people who are believed to belong to the same genetic stock
example: some biologists doubt that there are important genetic differences between races of human beings
ili: i79189
lexfile: noun.group
part of speech: noun
hypernym: 00031563-n