society-n
type: LexicalEntry
canonical form: society
sense: 07982754-n
part of speech: noun

07982754-n
type: LexicalConcept
in scheme: en-word.net
definition: an extended social group having a distinctive cultural and economic organization
ili: i79181
lexfile: noun.group
part of speech: noun
hypernym: 07967506-n
mero member: 08395550-n
mero part: 07983333-n
mero part: 07990472-n