combination-n
type: LexicalEntry
canonical form: combination
sense: 07981109-n
part of speech: noun

07981109-n
type: LexicalConcept
in scheme: en-word.net
definition: an alliance of people or corporations or countries for a special purpose (formerly to achieve some antisocial end but now for general political or economic purposes)
ili: i79176
lexfile: noun.group
part of speech: noun
domain topic: 06157599-n
hypernym: 08310903-n