people-n
type: LexicalEntry
canonical form: people
sense: 07958392-n
part of speech: noun

07958392-n
type: LexicalConcept
in scheme: en-word.net
definition: (plural) any group of human beings (men or women or children) collectively
example: old people
example: there were at least 200 people in the audience
ili: i79059
lexfile: noun.group
part of speech: noun
exemplifies: 06306016-n
hypernym: 00031563-n
mero member: 00007846-n