juice-n
type: LexicalEntry
canonical form: juice
sense: 07939988-n
part of speech: noun

07939988-n
type: LexicalConcept
in scheme: en-word.net
definition: the liquid part that can be extracted from plant or animal tissue by squeezing or cooking
ili: i78937
lexfile: noun.food
part of speech: noun
hypernym: 07581905-n