gimlet-n
type: LexicalEntry
canonical form: gimlet
sense: 07931235-n
part of speech: noun

07931235-n
type: LexicalConcept
in scheme: en-word.net
definition: a cocktail made of gin or vodka and lime juice
ili: i78871
lexfile: noun.food
part of speech: noun
hypernym: 07927917-n