spice-n
type: LexicalEntry
canonical form: spice
sense: 07828160-n
part of speech: noun

07828160-n
type: LexicalConcept
in scheme: en-word.net
definition: any of a variety of pungent aromatic vegetable substances used for flavoring food
ili: i78170
lexfile: noun.food
part of speech: noun
hypernym: 07825344-n