rambutan-n
type: LexicalEntry
canonical form: rambutan
sense: 07785707-n
part of speech: noun

rambotan-n
type: LexicalEntry
canonical form: rambotan
sense: 07785707-n
part of speech: noun

07785707-n
type: LexicalConcept
in scheme: en-word.net
definition: pleasantly acid bright red oval Malayan fruit covered with soft spines
ili: i77906
lexfile: noun.food
part of speech: noun
hypernym: 07721676-n