date-n
type: LexicalEntry
canonical form: date
sense: 07781049-n
part of speech: noun

07781049-n
type: LexicalConcept
in scheme: en-word.net
definition: sweet edible fruit of the date palm with a single long woody seed
ili: i77874
lexfile: noun.food
part of speech: noun
hypernym: 07721676-n