mushroom-n
type: LexicalEntry
canonical form: mushroom
sense: 07750720-n
part of speech: noun

07750720-n
type: LexicalConcept
in scheme: en-word.net
definition: fleshy body of any of numerous edible fungi
ili: i77680
lexfile: noun.food
part of speech: noun
hypernym: 07723196-n