stuffing-n
type: LexicalEntry
canonical form: stuffing
sense: 07694474-n
part of speech: noun

dressing-n
type: LexicalEntry
canonical form: dressing
sense: 07694474-n
part of speech: noun

07694474-n
type: LexicalConcept
in scheme: en-word.net
definition: a mixture of seasoned ingredients used to stuff meats and vegetables
ili: i77309
lexfile: noun.food
part of speech: noun
hypernym: 07898472-n